Ainda não tem acesso? Estude com a gente! Matricule-se
Ainda não tem acesso? Estude com a gente! Matricule-se
0
respostas

Projeto Flutter

Boa tarde estou com erro no projeto BytebankApp "Flutter "

segue erro no console e no emulador Insira aqui a descrição dessa imagem para ajudar na acessibilidade Insira aqui a descrição dessa imagem para ajudar na acessibilidade

FAILURE: Build failed with an exception.

  • Where: Build file 'C:\Users\FABIO\OneDrive\�rea de Trabalho\flutter-fundamentos-aula-5\android\app\build.gradle' line: 24
  • What went wrong: A problem occurred evaluating project ':app'.

    Failed to apply plugin [id 'com.android.application'] Your project path contains non-ASCII characters. This will most likely cause the build to fail on Windows. Please move your project to a different directory. See http://b.android.com/95744 for details. This warning can be disabled by adding the line 'android.overridePathCheck=true' to gradle.properties file in the project directory.

  • Try: Run with --stacktrace option to get the stack trace. Run with --info or --debug option to get more log output. Run with --scan to get full insights.

  • Get more help at https://help.gradle.org

BUILD FAILED in 5s Exception: Gradle task assembleDebug failed with exit code 1

Quer mergulhar em tecnologia e aprendizagem?

Receba a newsletter que o nosso CEO escreve pessoalmente, com insights do mercado de trabalho, ciência e desenvolvimento de software