Solucionado (ver solução)
Solucionado
(ver solução)
1
resposta

mvn compile resulta em build failure

executei o comando mvn compile como requisitado no exercicio, mas ele reclama da erro.

Estou utilizando windows 10 e Java 8. quando digito javac -version a saida é a seguinte javac 1.8.0_141

Segue a saida no terminal:

[ERROR] COMPILATION ERROR :
[INFO] -------------------------------------------------------------
[ERROR] No compiler is provided in this environment. Perhaps you are running on a JRE rather than a JDK?
[INFO] 1 error
[INFO] -------------------------------------------------------------
[INFO] ------------------------------------------------------------------------
[INFO] BUILD FAILURE
[INFO] ------------------------------------------------------------------------
[INFO] Total time:  1.216 s
[INFO] Finished at: 2018-12-28T15:05:15-02:00
[INFO] ------------------------------------------------------------------------
[ERROR] Failed to execute goal org.apache.maven.plugins:maven-compiler-plugin:3.1:compile (default-compile) on project produtos: Compilation failure
[ERROR] No compiler is provided in this environment. Perhaps you are running on a JRE rather than a JDK?
[ERROR]
[ERROR] -> [Help 1]
[ERROR]
[ERROR] To see the full stack trace of the errors, re-run Maven with the -e switch.
[ERROR] Re-run Maven using the -X switch to enable full debug logging.
[ERROR]
[ERROR] For more information about the errors and possible solutions, please read the following articles:
[ERROR] [Help 1] http://cwiki.apache.org/confluence/display/MAVEN/MojoFailureException
1 resposta
solução!

Oi Leonardo, isso acontece no Eclipse ou na linha de comando? Pergunto pois precisa ter configurado o JDK no Eclipse tbm.

Aqui tem um post de um aluno com o mesmo erro:

https://cursos.alura.com.br/forum/topico-nao-consigo-compilar-o-maven-22953

abs, Nico