Ainda não tem acesso? Estude com a gente! Matricule-se
Ainda não tem acesso? Estude com a gente! Matricule-se
1
resposta

Erro no build do projeto

BUILD FAILURE [INFO] ------------------------------------------------------------------------ [INFO] Total time: 0.502 s [INFO] Finished at: 2020-09-30T11:54:50-03:00 [INFO] ------------------------------------------------------------------------ [ERROR] Failed to execute goal org.apache.maven.plugins:maven-compiler-plugin:3.1:compile (default-compile) on project argentum-web: Compilation failure [ERROR] No compiler is provided in this environment. Perhaps you are running on a JRE rather than a JDK? [ERROR] [ERROR] -> [Help 1] [ERROR] [ERROR] To see the full stack trace of the errors, re-run Maven with the -e switch. [ERROR] Re-run Maven using the -X switch to enable full debug logging. [ERROR] [ERROR] For more information about the errors and possible solutions, please read the following articles: [ERROR] [Help 1] http://cwiki.apache.org/confluence/display/MAVEN/MojoFailureException

1 resposta

Olá Luis, tudo bem? O problema me parece ser que sua variável de ambiente JAVA_HOME está apontando para a pasta com a JRE (Java Runtime Environment) do Java porém o Maven só executa com JDK (JAVA Development Kit). Então você poderia acessar suas variáveis de ambiente e identificar para qual pasta a variável está apontando? Se estiver apontando para JRE o que é geralmente o padrão quando fazemos a instalação do Java então mude o caminho para a pasta do JDK.

E fala pra gente o resultado!

Quer mergulhar em tecnologia e aprendizagem?

Receba a newsletter que o nosso CEO escreve pessoalmente, com insights do mercado de trabalho, ciência e desenvolvimento de software