Ainda não tem acesso? Estude com a gente! Matricule-se
Ainda não tem acesso? Estude com a gente! Matricule-se

Erro ao rodar o comando

Downloading: https://repo.maven.apache.org/maven2/org/apache/maven/archetypes/maven-archetye-quickstart/1.0/maven-archetye-quickstart-1.0.jar
[INFO] ------------------------------------------------------------------------
[INFO] BUILD FAILURE
[INFO] ------------------------------------------------------------------------
[INFO] Total time: 02:14 min
[INFO] Finished at: 2019-04-16T22:26:10-03:00
[INFO] Final Memory: 19M/307M
[INFO] ------------------------------------------------------------------------
[ERROR] Failed to execute goal org.apache.maven.plugins:maven-archetype-plugin:3.0.1:generate (default-cli) on project standalone-pom: The desired archetype does not exist (org.apache.maven.archetypes:maven-archetye-quickstart:1.0) -> [Help 1]
[ERROR] 
[ERROR] To see the full stack trace of the errors, re-run Maven with the -e switch.
[ERROR] Re-run Maven using the -X switch to enable full debug logging.
[ERROR] 
[ERROR] For more information about the errors and possible solutions, please read the following articles:
[ERROR] [Help 1] http://cwiki.apache.org/confluence/display/MAVEN/MojoFailureException

Alguem por me ajudar por favor.

1 resposta

Desculpa a demora Gerson, ainda está com o erro ?