Ainda não tem acesso? Estude com a gente! Matricule-se
Ainda não tem acesso? Estude com a gente! Matricule-se

Erro ao Buildar o iOS

Quando dou o comando

npx react-native run-ios

ele abre o emulador, porém da erro de Building (descrito a baixo)

** BUILD FAILED **


The following build commands failed:
    CompileC /Users/brunoporreca/Library/Developer/Xcode/DerivedData/InstaAlura-fjjqdijlvtidfoecmeplgzzalwyh/Build/Intermediates.noindex/InstaAlura.build/Debug-iphonesimulator/InstaAlura.build/Objects-normal/x86_64/AppDelegate.o /Users/brunoporreca/Documents/projetoReactNative/InstaAlura/ios/InstaAlura/AppDelegate.m normal x86_64 objective-c com.apple.compilers.llvm.clang.1_0.compiler
(1 failure)

npm ERR! code 1
npm ERR! path /Users/brunoporreca/Documents/projetoReactNative/InstaAlura
npm ERR! command failed
npm ERR! command sh -c react-native "run-ios"

npm ERR! A complete log of this run can be found in:
npm ERR!     /Users/brunoporreca/.npm/_logs/2021-01-20T01_06_14_100Z-debug.log
brunoporreca@MBP-de-Bruno InstaAlura % 
1 resposta

Oi Bruno, consegue colar o que está escrito no log de erro mais recente no arquivo npm ERR! /Users/brunoporreca/.npm/_logs/2021-01-20T01_06_14_100Z-debug.log?

Quer mergulhar em tecnologia e aprendizagem?

Receba a newsletter que o nosso CEO escreve pessoalmente, com insights do mercado de trabalho, ciência e desenvolvimento de software